[SOLVED]Cannot compile warzone 2100 on slackware 13
Posted: 07 Nov 2009, 20:19
Hello, I'm trying to install warzone 2100 2.2.4 on my computer and its giving me the following troubling messages when I run make. I have all the dependencies including openal installed and the OPENAL_CFLAGS and OPENAL_LIBS environment variables set properly. Is there a config file I forgot to adjust or is there a bug? If it makes any difference I recently upgraded to the latest libtool 2.2.6 http://www.gnu.org/software/libtool/ to compile something else.
and it keeps talking about undefined references for a lenghty time and then ends with this
Code: Select all
/home/xovan/Downloads/warzone2100-2.2.4/lib/sequence/sequence.c:228: undefined reference to `alGenSources'
/home/xovan/Downloads/warzone2100-2.2.4/lib/sequence/sequence.c:232: undefined reference to `alGenBuffers'
/home/xovan/Downloads/warzone2100-2.2.4/lib/sequence/sequence.c:234: undefined reference to `alGenBuffers'
Code: Select all
collect2: ld returned 1 exit status
make[3]: *** [warzone2100] Error 1
make[3]: Leaving directory `/home/xovan/Downloads/warzone2100-2.2.4/src'
make[2]: *** [all] Error 2
make[2]: Leaving directory `/home/xovan/Downloads/warzone2100-2.2.4/src'
make[1]: *** [all-recursive] Error 1
make[1]: Leaving directory `/home/xovan/Downloads/warzone2100-2.2.4'
make: *** [all] Error 2