Can't compile 2.1 RC1 in build dir

Warzone 2.1.x series. (Unsupported--read only!)

Can't compile 2.1 RC1 in build dir

Postby sr-torte » 16 Nov 2008, 17:45

Hello,

I checked out the 2.1 RC1 tag and wanted to build in a build dir. This is my configure string:

Code: Select all
~/wz2100.svn/configure --prefix=/usr --srcdir=~/wz2100.svn/configure


During the build an error is encountered:
Code: Select all
Making all in aivolution/multiplay/skirmish
make[5]: Entering directory `/var/tmp/warzone2100-2.1_RC1-build2/data/mods/global/aivolution/multiplay/skirmish'
cp -p player0.slo player1.slo
cp: cannot stat `player0.slo': No such file or directory
make[5]: *** [player1.slo] Error 1
make[5]: Leaving directory `/var/tmp/warzone2100-2.1_RC1-build2/data/mods/global/aivolution/multiplay/skirmish'
make[4]: *** [all-recursive] Error 1
make[4]: Leaving directory `/var/tmp/warzone2100-2.1_RC1-build2/data/mods/global'
make[3]: *** [all-recursive] Error 1
make[3]: Leaving directory `/var/tmp/warzone2100-2.1_RC1-build2/data/mods'
make[2]: *** [all-recursive] Error 1
make[2]: Leaving directory `/var/tmp/warzone2100-2.1_RC1-build2/data'
make[1]: *** [all-recursive] Error 1
make[1]: Leaving directory `/var/tmp/warzone2100-2.1_RC1-build2'
make: *** [all] Error 2


One can remove this error, compile and play the game when one copies data/mods/global/aivolution/multiplay/skirmish/player0.* to ones build dir manually.
Cheers
sr-torte
New user
 
Posts: 1
Joined: 16 Nov 2008, 15:58

Return to 2.1.x