Build errors

Warzone 2.1.x series. (Unsupported--read only!)
Locked
maacruz
Greenhorn
Posts: 12
Joined: 05 Dec 2006, 17:19

Build errors

Post by maacruz » 16 Jul 2008, 22:01

Hi,
I'm trying to build svn (rev 5570 as of today) on opensuse 10.3, but it fails. Any help?

stdout dump:
make[4]: se ingresa al directorio `/usr/src/packages/BUILD/warzone/lib/framework'
gcc -std=gnu99 -DHAVE_CONFIG_H -I. -I../.. -DYY_NO_INPUT -D_GNU_SOURCE=1 -D_REENTRANT -I/usr/include/SDL -DDEBUG -DDATADIR="\"/usr/local/share/warzone2100\"" -DLOCALEDIR="\"/usr/local/share/locale\"" -I../.. -O0 -g -Wall -Werror -Wno-unused-label -Wno-pointer-to-int-cast -Wmissing-field-initializers -Wcast-align -Wwrite-strings -Wmissing-declarations -Wstrict-prototypes -Wpointer-arith -MT resource_lexer.lex.o -MD -MP -MF .deps/resource_lexer.lex.Tpo -c -o resource_lexer.lex.o resource_lexer.lex.c
cc1: warnings being treated as errors
resource_lexer.lex.c:1737: warning: no previous declaration for ‘res_get_lineno’
resource_lexer.lex.c:1746: warning: no previous declaration for ‘res_get_in’
resource_lexer.lex.c:1754: warning: no previous declaration for ‘res_get_out’
resource_lexer.lex.c:1762: warning: no previous declaration for ‘res_get_leng’
resource_lexer.lex.c:1771: warning: no previous declaration for ‘res_get_text’
resource_lexer.lex.c:1780: warning: no previous declaration for ‘res_set_lineno’
resource_lexer.lex.c:1792: warning: no previous declaration for ‘res_set_in’
resource_lexer.lex.c:1797: warning: no previous declaration for ‘res_set_out’
resource_lexer.lex.c:1802: warning: no previous declaration for ‘res_get_debug’
resource_lexer.lex.c:1807: warning: no previous declaration for ‘res_set_debug’
make[4]: *** [resource_lexer.lex.o] Error 1
make[4]: se sale del directorio `/usr/src/packages/BUILD/warzone/lib/framework'
make[3]: *** [all] Error 2
make[3]: se sale del directorio `/usr/src/packages/BUILD/warzone/lib/framework'
make[2]: *** [all-recursive] Error 1
make[2]: se sale del directorio `/usr/src/packages/BUILD/warzone/lib'
make[1]: *** [all-recursive] Error 1
make[1]: se sale del directorio `/usr/src/packages/BUILD/warzone'
make: *** [all] Error 2

Locked